Target
Cytochrome P450 2C19
Ligand
BDBM50041983
Substrate
Meas. Tech.
ChEMBL_1443698 (CHEMBL3380171)
IC50
>50000±n/a nM
Citation
 Buzard, DJLopez, LMoody, JKawasaki, ASchrader, TOKasem, MJohnson, BZhu, XThoresen, LKim, SHGharbaoui, TSengupta, DCalvano, LKrishnan, AGao, YSemple, GEdwards, JBarden, JMorgan, MUsmani, KChen, CSadeque, AChen, WChristopher, RJThatte, JFu, LSolomon, MWhelan, KAl-Shamma, HGatlin, JGaidarov, IAnthony, TLe, MUnett, DJStirn, SBlackburn, ABehan, DPJones, RM (7-Benzyloxy-2,3-dihydro-1H-pyrrolo[1,2-a]indol-1-yl)acetic Acids as S1P1 Functional Antagonists. ACS Med Chem Lett 5:1334-9 (2014)  
Target
Name:
Cytochrome P450 2C19
Synonyms:
(R)-limonene 6-monooxygenase (S)-limonene 7-monooxygenase CYP2C19 CYPIIC19 Cytochrome P450 2C19 [I331V] Cytochrome P450-254C Mephenytoin 4-hydroxylase P450-254C
Type:
Enzyme
Mol. Mass.:
55935.47
Organism:
Homo sapiens (Human)
Description:
P33261
Residue:
490
  
Inhibitor
Name:
BDBM50041983
Synonyms:
CHEMBL3359523
Type:
Small organic molecule
Emp. Form.:
C24H23ClF3NO4
Mol. Mass.:
481.892
SMILES:
CC(C)Oc1ccc(COc2ccc3n4CC[C@H](CC(O)=O)c4c(Cl)c3c2)cc1C(F)(F)F
: