Target
ATP-dependent translocase ABCB1
Ligand
BDBM50056305
Substrate
Meas. Tech.
ChEMBL_1449768 (CHEMBL3378755)
IC50
9200±n/a nM
Citation
 Tardia, PStefanachi, ANiso, MStolfa, DAMangiatordi, GFAlberga, DNicolotti, OLattanzi, GCarotti, ALeonetti, FPerrone, RBerardi, FAzzariti, AColabufo, NACellamare, S Trimethoxybenzanilide-based P-glycoprotein modulators: an interesting case of lipophilicity tuning by intramolecular hydrogen bonding. J Med Chem 57:6403-18 (2014)  
Target
Name:
ATP-dependent translocase ABCB1
Synonyms:
ABCB1 MDR1_HUMAN Multidrug resistance protein 1 P-glycoprotein (P-gp) PGY1
Type:
Protein
Mol. Mass.:
141503.50
Organism:
Homo sapiens (Human)
Description:
P08183
Residue:
1280
  
Inhibitor
Name:
BDBM50056305
Synonyms:
CHEMBL3317929
Type:
Small organic molecule
Emp. Form.:
C18H13FN2O
Mol. Mass.:
292.307
SMILES:
Fc1cc(ccc1NC(=O)c1ccccc1)-c1cccnc1
: