Target
Multidrug resistance-associated protein 1
Ligand
BDBM50056305
Substrate
Meas. Tech.
ChEMBL_1449769 (CHEMBL3378756)
IC50
>100000±n/a nM
Citation
 Tardia, PStefanachi, ANiso, MStolfa, DAMangiatordi, GFAlberga, DNicolotti, OLattanzi, GCarotti, ALeonetti, FPerrone, RBerardi, FAzzariti, AColabufo, NACellamare, S Trimethoxybenzanilide-based P-glycoprotein modulators: an interesting case of lipophilicity tuning by intramolecular hydrogen bonding. J Med Chem 57:6403-18 (2014)  
Target
Name:
Multidrug resistance-associated protein 1
Synonyms:
7.6.2.2 ABCC1 ATP-binding cassette, sub-family C, member 1 isoform 1 LTC4 transporter MRP MRP1_HUMAN
Type:
Mol. Mass.:
171597.72
Organism:
Homo sapiens (Human)
Description:
P33527
Residue:
1531
  
Inhibitor
Name:
BDBM50056305
Synonyms:
CHEMBL3317929
Type:
Small organic molecule
Emp. Form.:
C18H13FN2O
Mol. Mass.:
292.307
SMILES:
Fc1cc(ccc1NC(=O)c1ccccc1)-c1cccnc1
: