Target
Proto-oncogene tyrosine-protein kinase Src
Ligand
BDBM50116793
Substrate
Meas. Tech.
ChEMBL_1515327 (CHEMBL3615120)
IC50
21600±n/a nM
Citation
 Thakur, ASingla, RJaitak, V Coumarins as anticancer agents: a review on synthetic strategies, mechanism of action and SAR studies. Eur J Med Chem 101:476-95 (2015)  
Target
Name:
Proto-oncogene tyrosine-protein kinase Src
Synonyms:
Calmodulin/Proto-oncogene tyrosine-protein kinase Src Proto-oncogene c-Src SRC SRC_HUMAN V-src sarcoma (Schmidt-Ruppin A-2) viral oncogene homolog (avian) p60-Src | pp60c-src
Type:
Protein
Mol. Mass.:
59838.60
Organism:
Homo sapiens (Human)
Description:
P12931
Residue:
536
  
Inhibitor
Name:
BDBM50116793
Synonyms:
CHEMBL3612750
Type:
Small organic molecule
Emp. Form.:
C26H40BrNO4
Mol. Mass.:
510.504
SMILES:
Br.CCCCCCCCCCc1c(C)c2ccc(cc2oc1=O)N(CC)CCCC(O)=O
: