Target
Histone deacetylase 1
Ligand
BDBM50354086
Substrate
Meas. Tech.
ChEMBL_1523183 (CHEMBL3632099)
IC50
4.0±n/a nM
Citation
 Ni, MEsposito, ERaj, VPMuzi, LZunino, FZuco, VCominetti, DPenco, SDal Pozzo, A New macrocyclic analogs of the natural histone deacetylase inhibitor FK228; design, synthesis and preliminary biological evaluation. Bioorg Med Chem 23:6785-93 (2015)  
Target
Name:
Histone deacetylase 1
Synonyms:
Cereblon/Histone deacetylase 1 HDAC1 Histone deacetylase 1 (HDAC1) RPD3L1
Type:
Enzyme
Mol. Mass.:
55090.27
Organism:
Homo sapiens (Human)
Description:
Q13547
Residue:
482
  
Inhibitor
Name:
BDBM50354086
Synonyms:
FK-228 ROMIDEPSIN
Type:
Small organic molecule
Emp. Form.:
C25H39N3O6S2
Mol. Mass.:
541.724
SMILES:
C\C=C1/NC(=O)[C@@H](CS)NC(=O)[C@H](CC(=O)C[C@H](OC(=O)[C@@H](NC1=O)C(C)C)\C=C\CCS)C(C)C
: