Target
Histone deacetylase 1
Ligand
BDBM50129132
Substrate
Meas. Tech.
ChEMBL_1523183 (CHEMBL3632099)
IC50
1270±n/a nM
Citation
 Ni, MEsposito, ERaj, VPMuzi, LZunino, FZuco, VCominetti, DPenco, SDal Pozzo, A New macrocyclic analogs of the natural histone deacetylase inhibitor FK228; design, synthesis and preliminary biological evaluation. Bioorg Med Chem 23:6785-93 (2015)  
Target
Name:
Histone deacetylase 1
Synonyms:
Cereblon/Histone deacetylase 1 HDAC1 Histone deacetylase 1 (HDAC1) RPD3L1
Type:
Enzyme
Mol. Mass.:
55090.27
Organism:
Homo sapiens (Human)
Description:
Q13547
Residue:
482
  
Inhibitor
Name:
BDBM50129132
Synonyms:
CHEMBL3628319
Type:
Small organic molecule
Emp. Form.:
C30H50N4O7S
Mol. Mass.:
610.806
SMILES:
CCCCCCCC(=O)SCC\C=C\[C@@H]1CC(=O)N[C@H](C(C)C)C(=O)N[C@H](C)C(=O)N[C@H](C(C)C)C(=O)NCC(=O)O1
: