Target
Histone deacetylase 6
Ligand
BDBM50129132
Substrate
Meas. Tech.
ChEMBL_1523184 (CHEMBL3632100)
IC50
18300±n/a nM
Citation
 Ni, MEsposito, ERaj, VPMuzi, LZunino, FZuco, VCominetti, DPenco, SDal Pozzo, A New macrocyclic analogs of the natural histone deacetylase inhibitor FK228; design, synthesis and preliminary biological evaluation. Bioorg Med Chem 23:6785-93 (2015)  
Target
Name:
Histone deacetylase 6
Synonyms:
Cereblon/Histone deacetylase 6 HDAC6 Histone deacetylase 6 (HDAC6) KIAA0901 | ORF Names:JM21
Type:
Chromatin regulator; hydrolase; repressor
Mol. Mass.:
131381.51
Organism:
Homo sapiens (Human)
Description:
Q9UBN7
Residue:
1215
  
Inhibitor
Name:
BDBM50129132
Synonyms:
CHEMBL3628319
Type:
Small organic molecule
Emp. Form.:
C30H50N4O7S
Mol. Mass.:
610.806
SMILES:
CCCCCCCC(=O)SCC\C=C\[C@@H]1CC(=O)N[C@H](C(C)C)C(=O)N[C@H](C)C(=O)N[C@H](C(C)C)C(=O)NCC(=O)O1
: