Target
Histone deacetylase 6
Ligand
BDBM50129134
Substrate
Meas. Tech.
ChEMBL_1523184 (CHEMBL3632100)
IC50
8670±n/a nM
Citation
 Ni, MEsposito, ERaj, VPMuzi, LZunino, FZuco, VCominetti, DPenco, SDal Pozzo, A New macrocyclic analogs of the natural histone deacetylase inhibitor FK228; design, synthesis and preliminary biological evaluation. Bioorg Med Chem 23:6785-93 (2015)  
Target
Name:
Histone deacetylase 6
Synonyms:
Cereblon/Histone deacetylase 6 HDAC6 Histone deacetylase 6 (HDAC6) KIAA0901 | ORF Names:JM21
Type:
Chromatin regulator; hydrolase; repressor
Mol. Mass.:
131381.51
Organism:
Homo sapiens (Human)
Description:
Q9UBN7
Residue:
1215
  
Inhibitor
Name:
BDBM50129134
Synonyms:
CHEMBL3628322
Type:
Small organic molecule
Emp. Form.:
C31H42N6O6S
Mol. Mass.:
626.767
SMILES:
CC(C)[C@H]1NC(=O)[C@@H](Cc2ccccc2)NC(=O)[C@H](NC(=O)C[C@H](OC(=O)Cn2cc1nn2)\C=C\CCSC(C)=O)C(C)C
: