Target
Breakpoint cluster region protein/Tyrosine-protein kinase ABL1
Ligand
BDBM31085
Substrate
Meas. Tech.
ChEMBL_1577464 (CHEMBL3806737)
IC50
580±n/a nM
Citation
 Cherian, JNacro, KPoh, ZYGuo, SJeyaraj, DAWong, YXHo, MYang, HYJoy, JKKwek, ZPLiu, BWee, JLOng, EHChoong, MLPoulsen, ALee, MAPendharkar, VDing, LJManoharan, VChew, YSSangthongpitag, KLim, SOng, STHill, JKeller, TH Structure-Activity Relationship Studies of Mitogen Activated Protein Kinase Interacting Kinase (MNK) 1 and 2 and BCR-ABL1 Inhibitors Targeting Chronic Myeloid Leukemic Cells. J Med Chem 59:3063-78 (2016)  
Target
Name:
Breakpoint cluster region protein/Tyrosine-protein kinase ABL1
Synonyms:
Bcr-Abl Breakpoint cluster region protein /Tyrosine-protein kinase ABL | Tyrosine-protein kinase ABL1/Breakpoint cluster region protein
Type:
Enzyme
Mol. Mass.:
Description:
Components:
This complex has 2 components.
Component 1
Name:
Tyrosine-protein kinase ABL1
Synonyms:
ABL ABL1_HUMAN JTK7 Proto-oncogene tyrosine-protein kinase ABL1 Tyrosine-protein kinase ABL V-abl Abelson murine leukemia viral oncogene homolog 1 p150 | tyrosine-protein kinase ABL1 isoform a
Type:
Enzyme
Mol. Mass.:
122897.30
Organism:
Homo sapiens (Human)
Description:
P00519
Residue:
1130
  
Component 2
Name:
Breakpoint cluster region protein
Synonyms:
BCR BCR_HUMAN Breakpoint cluster region protein | D22S11
Type:
PROTEIN
Mol. Mass.:
142824.75
Organism:
Homo sapiens (Human)
Description:
ChEMBL_305348
Residue:
1271
  
Inhibitor
Name:
BDBM31085
Synonyms:
1-[4-[(4-ethyl-1-piperazinyl)methyl]-3-(trifluoromethyl)phenyl]-3-[4-[[6-(methylamino)-4-pyrimidinyl]oxy]phenyl]urea 1-[4-[(4-ethylpiperazino)methyl]-3-(trifluoromethyl)phenyl]-3-[4-[6-(methylamino)pyrimidin-4-yl]oxyphenyl]urea cid_11409972
Type:
Small organic molecule
Emp. Form.:
C26H30F3N7O2
Mol. Mass.:
529.5573
SMILES:
CCN1CCN(Cc2ccc(NC(=O)Nc3ccc(Oc4cc(NC)ncn4)cc3)cc2C(F)(F)F)CC1
: