Target
Proto-oncogene tyrosine-protein kinase Src
Ligand
BDBM50196853
Substrate
Meas. Tech.
ChEMBL_1618939 (CHEMBL3861108)
IC50
14400±n/a nM
Citation
 Wang, YDBao, XQXu, SYu, WWCao, SNHu, JPLi, YWang, XLZhang, DYu, SS A Novel Parkinson's Disease Drug Candidate with Potent Anti-neuroinflammatory Effects through the Src Signaling Pathway. J Med Chem 59:9062-9079 (2016)  
Target
Name:
Proto-oncogene tyrosine-protein kinase Src
Synonyms:
Neuronal proto-oncogene tyrosine-protein kinase Src SRC_MOUSE Tyrosine-protein kinase SRC | pp60c-srcĀ (p60-Src)
Type:
Protein
Mol. Mass.:
59894.66
Organism:
Mus musculus (Mouse)
Description:
P05480
Residue:
535
  
Inhibitor
Name:
BDBM50196853
Synonyms:
CHEMBL3970451
Type:
Small organic molecule
Emp. Form.:
C14H19NO7
Mol. Mass.:
313.3032
SMILES:
COc1cc(OC)c(CN[C@@H](CC(O)=O)C(O)=O)c(OC)c1
: