Target
Proto-oncogene tyrosine-protein kinase Src
Ligand
BDBM50196889
Substrate
Meas. Tech.
ChEMBL_1618939 (CHEMBL3861108)
IC50
74000±n/a nM
Citation
 Wang, YDBao, XQXu, SYu, WWCao, SNHu, JPLi, YWang, XLZhang, DYu, SS A Novel Parkinson's Disease Drug Candidate with Potent Anti-neuroinflammatory Effects through the Src Signaling Pathway. J Med Chem 59:9062-9079 (2016)  
Target
Name:
Proto-oncogene tyrosine-protein kinase Src
Synonyms:
Neuronal proto-oncogene tyrosine-protein kinase Src SRC_MOUSE Tyrosine-protein kinase SRC | pp60c-srcĀ (p60-Src)
Type:
Protein
Mol. Mass.:
59894.66
Organism:
Mus musculus (Mouse)
Description:
P05480
Residue:
535
  
Inhibitor
Name:
BDBM50196889
Synonyms:
CHEMBL3974513
Type:
Small organic molecule
Emp. Form.:
C17H28ClNO5
Mol. Mass.:
361.861
SMILES:
Cl.CC(C)CC(=O)c1c(O)cc(O)cc1OCC(O)CNC(C)C
: