Target
5-hydroxytryptamine receptor 3A
Ligand
BDBM50232615
Substrate
Meas. Tech.
ChEBML_1648184
IC50
39000±n/a nM
Citation
 Iwuagwu, CKing, DMcDonald, IMCook, JZusi, FCHill, MDMate, RAFang, HKnox, RGallagher, LPost-Munson Amy Easton, DMiller, RBenitex, YSiuciak, JLodge, NZaczek, RMorgan, DBristow, LMacor, JEOlson, RE Design and synthesis of a novel series of 4-heteroarylamino-1'-azaspiro[oxazole-5,3'-bicyclo[2.2.2]octanes asa7 nicotinic receptor agonists 2. Development of 4-heteroaryl SAR. Bioorg Med Chem Lett 27:1261-1266 (2017)  
Target
Name:
5-hydroxytryptamine receptor 3A
Synonyms:
5-HT-3 5-HT3A 5-hydroxytryptamine receptor 3 (5-HT3) 5-hydroxytryptamine receptor 3A (5HT3A) 5HT3R HTR3A Serotonin 3 receptor (5HT3) Serotonin-gated ion channel receptor | Serotonin-gated ion channel receptor 3
Type:
Protein
Mol. Mass.:
55283.27
Organism:
Homo sapiens (Human)
Description:
P46098
Residue:
478
  
Inhibitor
Name:
BDBM50232615
Synonyms:
CHEMBL4091037
Type:
Small organic molecule
Emp. Form.:
C14H19N5O
Mol. Mass.:
273.3336
SMILES:
Cc1nccnc1NC1=NC[C@@]2(CN3CCC2CC3)O1
: