Target
Cyclin-dependent kinase 1
Ligand
BDBM50358211
Substrate
Meas. Tech.
Kinase Assay
pH
7.4±n/a
IC50
4400±n/a nM
Comments
extracted
Citation
 Fischer, PMJarman, MMcDonald, ENutley, BRaynaud, FWilson, SWorkman, P Purine derivatives US Patent  US8846696 Publication Date 9/30/2014 
Target
Name:
Cyclin-dependent kinase 1
Synonyms:
CDC2 CDK1 CDKN1 Cell division protein kinase 1 P34CDC2 | p34 protein kinase
Type:
Enzyme Subunit
Mol. Mass.:
34101.08
Organism:
Homo sapiens (Human)
Description:
P06493
Residue:
297
  
Inhibitor
Name:
BDBM50358211
Synonyms:
CHEMBL1922212 | US8846696, (3S)-3-{9-Isopropyl-6-[(pyridin-3-ylmethyl)-amino]-9H-purin-2-ylamino}-2-methyl-pentan-2-ol
Type:
Small organic molecule
Emp. Form.:
C20H29N7O
Mol. Mass.:
383.4906
SMILES:
CC[C@H](Nc1nc(NCc2cccnc2)c2ncn(C(C)C)c2n1)C(C)(C)O
: