Target
Proto-oncogene tyrosine-protein kinase Src
Ligand
BDBM4846
Substrate
Poly(E:Y)
Meas. Tech.
Kinase Inhibition Assay
IC50
>50000±n/a nM
Citation
 Connolly, CJHamby, JMSchroeder, MCBarvian, MLu, GHPanek, RLAmar, AShen, CKraker, AJFry, DWKlohs, WDDoherty, AM DISCOVERY AND STRUCTURE-ACTIVITY STUDIES OF A NOVEL SERIES OF PYRIDO[2,3-d]PYRIMIDINE TYROSINE KINASE INHIBITORS Bioorg Med Chem Lett 7:2415-20 (1997)    Article 
Target
Name:
Proto-oncogene tyrosine-protein kinase Src
Synonyms:
Calmodulin/Proto-oncogene tyrosine-protein kinase Src Proto-oncogene c-Src SRC SRC_HUMAN V-src sarcoma (Schmidt-Ruppin A-2) viral oncogene homolog (avian) p60-Src | pp60c-src
Type:
Protein
Mol. Mass.:
59838.60
Organism:
Homo sapiens (Human)
Description:
P12931
Residue:
536
  
Inhibitor
Name:
BDBM4846
Synonyms:
1-[2-amino-6-(3,4-dimethoxyphenyl)pyrido[2,3-d]pyrimidin-7-yl]-3-tert-butylurea | PD089828 analog 27
Type:
Small organic molecule
Emp. Form.:
C20H24N6O3
Mol. Mass.:
396.443
SMILES:
COc1ccc(cc1OC)-c1cc2cnc(N)nc2nc1NC(=O)NC(C)(C)C
:
Substrate
Name:
Poly(E:Y)
Synonyms:
Type:
Random polymer
Mol. Mass.:
358.43
Organism:
Description:
Random copolymer of glutamic acid and tyrosine (4:1). 50 uM ATP containing 0.4 uCi of [gamma-32P]ATP as co-substrate
Residue:
3
NA