Target
Retinal rod rhodopsin-sensitive cGMP 3',5'-cyclic phosphodiesterase subunit delta
Ligand
BDBM481588
Substrate
Meas. Tech.
Fluorescence Polarization Assay
Kd
16±n/a nM
Citation
 Waldmann, HMartin-Gago, PAMurarka, SKlein, CBastiaens, PWittinghofer, AFansa, EK Benzene disulfonamide for the treatment of cancer US Patent  US10913710 Publication Date 2/9/2021 
Target
Name:
Retinal rod rhodopsin-sensitive cGMP 3',5'-cyclic phosphodiesterase subunit delta
Synonyms:
3',5'-cyclic phosphodiesterase PDE6D PDED Retinal rod rhodopsin-sensitive cGMP 3',5'-cyclic phosphodiesterase subunit delta
Type:
PROTEIN
Mol. Mass.:
17418.30
Organism:
Homo sapiens (Human)
Description:
ChEMBL_105761
Residue:
150
  
Inhibitor
Name:
BDBM481588
Synonyms:
US10913710, Compound 6
Type:
Small organic molecule
Emp. Form.:
C32H40ClN3O4S2
Mol. Mass.:
630.261
SMILES:
CN1CCC(CN(Cc2ccccc2)S(=O)(=O)c2ccc(cc2)S(=O)(=O)N(Cc2ccc(Cl)cc2)C2CCCC2)CC1
: