Target
Retinal rod rhodopsin-sensitive cGMP 3',5'-cyclic phosphodiesterase subunit delta
Ligand
BDBM481593
Substrate
Meas. Tech.
Fluorescence Polarization Assay
Kd
16±n/a nM
Citation
 Waldmann, HMartin-Gago, PAMurarka, SKlein, CBastiaens, PWittinghofer, AFansa, EK Benzene disulfonamide for the treatment of cancer US Patent  US10913710 Publication Date 2/9/2021 
Target
Name:
Retinal rod rhodopsin-sensitive cGMP 3',5'-cyclic phosphodiesterase subunit delta
Synonyms:
3',5'-cyclic phosphodiesterase PDE6D PDED Retinal rod rhodopsin-sensitive cGMP 3',5'-cyclic phosphodiesterase subunit delta
Type:
PROTEIN
Mol. Mass.:
17418.30
Organism:
Homo sapiens (Human)
Description:
ChEMBL_105761
Residue:
150
  
Inhibitor
Name:
BDBM481593
Synonyms:
US10913710, Compound 9
Type:
Small organic molecule
Emp. Form.:
C32H39ClN2O4S2
Mol. Mass.:
615.246
SMILES:
Clc1ccc(CN(C2CCCC2)S(=O)(=O)c2ccc(cc2)S(=O)(=O)N(CC2CCCCC2)Cc2ccccc2)cc1
: