Target
Glycogen synthase kinase-3 alpha
Ligand
BDBM8305
Substrate
Biotinylated Peptide Substrate
Meas. Tech.
Kinase Inhibition SPA Assay
pH
7±n/a
Temperature
295.15±n/a K
IC50
>5000±n/a nM
Citation
 Witherington, JBordas, VGarland, SLHickey, DMIfe, RJLiddle, JSaunders, MSmith, DGWard, RW 5-aryl-pyrazolo[3,4-b]pyridines: potent inhibitors of glycogen synthase kinase-3 (GSK-3). Bioorg Med Chem Lett 13:1577-80 (2003)  
Target
Name:
Glycogen synthase kinase-3 alpha
Synonyms:
GSK-3 alpha GSK3A_HUMAN Glycogen synthase kinase-3 Glycogen synthase kinase-3 alpha (GSK3 Alpha) Glycogen synthase kinase-3 alpha (GSK3alpha)
Type:
Enzyme
Mol. Mass.:
50991.79
Organism:
Homo sapiens (Human)
Description:
P49840
Residue:
483
  
Inhibitor
Name:
BDBM8305
Synonyms:
5-phenyl-1H-pyrrolo[2,3-b]pyridin-3-amine | pyrrolopyridine deriv. 8
Type:
Small organic molecule
Emp. Form.:
C13H11N3
Mol. Mass.:
209.2465
SMILES:
Nc1c[nH]c2ncc(cc12)-c1ccccc1
:
Substrate
Name:
Biotinylated Peptide Substrate
Synonyms:
Type:
Peptide
Mol. Mass.:
3615.87
Organism:
Description:
Residue:
32