Target
Tyrosine-protein kinase BTK
Ligand
BDBM348553
Substrate
Meas. Tech.
In Vitro BTK Kinase Assay
IC50
<100±n/a nM
Citation
 Bui, MConlon, PCuervo, JHErlanson, DAFan, JGuan, BHopkins, BTJenkins, TJKumaravel, GLugovskoy, AAMarcotte, DPowell, NScott, DSilvian, LTaveras, AWang, DZhong, M Bruton's tyrosine kinase inhibitors US Patent  US9790229 Publication Date 10/17/2017 
Target
Name:
Tyrosine-protein kinase BTK
Synonyms:
AGMX1 Agammaglobulinaemia tyrosine kinase B cell progenitor kinase BPK BTK_HUMAN Tyrosine Kinase BTK Tyrosine-protein kinase BTK (BTK)
Type:
Enzyme
Mol. Mass.:
76289.95
Organism:
Homo sapiens (Human)
Description:
Q06187
Residue:
659
  
Inhibitor
Name:
BDBM348553
Synonyms:
US10577374, Compound 276 | US9790229, Compound 276
Type:
Small organic molecule
Emp. Form.:
C22H24Cl2N6O
Mol. Mass.:
459.372
SMILES:
Clc1cc(Cl)cc(NC2CCCN([C@@H]3CCCN(C3)c3ncnc4[nH]ccc34)C2=O)c1
: