Target
Tyrosine-protein kinase BTK
Ligand
BDBM348590
Substrate
Meas. Tech.
In Vitro BTK Kinase Assay
IC50
<100±n/a nM
Citation
 Bui, MConlon, PCuervo, JHErlanson, DAFan, JGuan, BHopkins, BTJenkins, TJKumaravel, GLugovskoy, AAMarcotte, DPowell, NScott, DSilvian, LTaveras, AWang, DZhong, M Bruton's tyrosine kinase inhibitors US Patent  US9790229 Publication Date 10/17/2017 
Target
Name:
Tyrosine-protein kinase BTK
Synonyms:
AGMX1 Agammaglobulinaemia tyrosine kinase B cell progenitor kinase BPK BTK_HUMAN Tyrosine Kinase BTK Tyrosine-protein kinase BTK (BTK)
Type:
Enzyme
Mol. Mass.:
76289.95
Organism:
Homo sapiens (Human)
Description:
Q06187
Residue:
659
  
Inhibitor
Name:
BDBM348590
Synonyms:
US10577374, Compound 313 | US9790229, Compound 313
Type:
Small organic molecule
Emp. Form.:
C20H23ClF2N6O
Mol. Mass.:
436.886
SMILES:
Nc1ncnc(N2CCC[C@H](C2)N2CCC[C@H](Nc3cc(F)cc(Cl)c3)C2=O)c1F
: