Target
Cathepsin B
Ligand
BDBM19804
Substrate
BDBM19485
Meas. Tech.
In Vitro Enzyme Inhibition Assay
pH
5.5±n/a
Temperature
295.15±n/a K
Ki
7800±n/a nM
Citation
 Marquis, RWRu, YZeng, JTrout, RELoCastro, SMGribble, ADWitherington, JFenwick, AEGarnier, BTomaszek, TTew, DHemling, MEQuinn, CJSmith, WWZhao, BMcQueney, MSJanson, CAD'Alessio, KVeber, DF Cyclic ketone inhibitors of the cysteine protease cathepsin K. J Med Chem 44:725-36 (2001)  
Target
Name:
Cathepsin B
Synonyms:
APP secretase CATB_HUMAN CTSB Cathepsin B light chain | Cathepsin B1
Type:
Enzyme
Mol. Mass.:
37819.69
Organism:
Homo sapiens (Human)
Description:
gi_63102437
Residue:
339
  
Inhibitor
Name:
BDBM19804
Synonyms:
(2S)-4-methyl-N-(4-oxooxolan-3-yl)-2-(quinolin-2-ylformamido)pentanamide CHEMBL62239
Type:
Small organic molecule
Emp. Form.:
C20H23N3O4
Mol. Mass.:
369.4143
SMILES:
CC(C)C[C@H](NC(=O)c1ccc2ccccc2n1)C(=O)NC1COCC1=O
:
Substrate
Name:
BDBM19485
Synonyms:
Cbz-Phe-Arg-AMC Z-Phe-Arg-AMC.HCl
Type:
Emp. Form.:
Mol. Mass.:
SMILES:
: