Target
Anoctamin-1
Ligand
BDBM50239449
Substrate
Meas. Tech.
ChEMBL_1666071 (CHEMBL4015867)
IC50
3000±n/a nM
Citation
 Truong, ECPhuan, PWReggi, ALFerrera, LGalietta, LJVLevy, SEMoises, ACCil, ODiez-Cecilia, ELee, SVerkman, ASAnderson, MO Substituted 2-Acylaminocycloalkylthiophene-3-carboxylic Acid Arylamides as Inhibitors of the Calcium-Activated Chloride Channel Transmembrane Protein 16A (TMEM16A). J Med Chem 60:4626-4635 (2017)  
Target
Name:
Anoctamin-1
Synonyms:
ANO1 DOG1 ORAOV2 TAOS2 Transmembrane protein 16A | Tumor-amplified and overexpressed sequence 2
Type:
PROTEIN
Mol. Mass.:
114103.63
Organism:
Homo sapiens (Human)
Description:
ChEMBL_828184
Residue:
986
  
Inhibitor
Name:
BDBM50239449
Synonyms:
CHEMBL4088086
Type:
Small organic molecule
Emp. Form.:
C18H20N2O3S
Mol. Mass.:
344.428
SMILES:
CCC(=O)Nc1sc2COCCc2c1C(=O)Nc1ccccc1C
: