Target
Tyrosine-protein phosphatase non-receptor type 1
Ligand
BDBM50177318
Substrate
Meas. Tech.
ChEMBL_331857 (CHEMBL865873)
IC50
140±n/a nM
Citation
 Cho, SYBaek, JYHan, SSKang, SKHa, JDAhn, JHLee, JDKim, KRCheon, HGRhee, SDYang, SDYon, GHPak, CSChoi, JK PTP-1B inhibitors: cyclopenta[d][1,2]-oxazine derivatives. Bioorg Med Chem Lett 16:499-502 (2005)  
Target
Name:
Tyrosine-protein phosphatase non-receptor type 1
Synonyms:
PTN1_HUMAN PTPN1 Protein tyrosine phosphatase-1B (PTP1B) Protein-tyrosine phosphatase 1B (PTP1B) Tyrosine-protein phosphatase non-receptor type 1 (PTP1B)
Type:
Protein phosphatase
Mol. Mass.:
49963.76
Organism:
Homo sapiens (Human)
Description:
Human recombinant GST-fusion PTP1B (1-435).
Residue:
435
  
Inhibitor
Name:
BDBM50177318
Synonyms:
2-(4-(7-(4-tetradecylbenzoyl)cyclopenta[d][1,2]oxazin-4-yl)phenoxy)acetic acid | CHEMBL200117
Type:
Small organic molecule
Emp. Form.:
C36H43NO5
Mol. Mass.:
569.7303
SMILES:
CCCCCCCCCCCCCCc1ccc(cc1)C(=O)c1ccc2c(nocc12)-c1ccc(OCC(O)=O)cc1
: