Target
Dipeptidyl peptidase 4
Ligand
BDBM50337763
Substrate
Meas. Tech.
ChEMBL_726769 (CHEMBL1686243)
IC50
88±n/a nM
Citation
 Park, WSKang, SKJun, MAShin, MSKim, KYRhee, SDBae, MAKim, MSKim, KRKang, NSYoo, SELee, JOSong, DHSilinski, PSchneider, SEAhn, JHKim, SS Discovery ofß-aminoacyl containing thiazolidine derivatives as potent and selective dipeptidyl peptidase IV inhibitors. Bioorg Med Chem Lett 21:1366-70 (2011)  
Target
Name:
Dipeptidyl peptidase 4
Synonyms:
ADABP Adenosine deaminase complexing protein 2 CD_antigen=CD26 DPP4 DPPIV Dipeptidyl peptidase 4 (DPP IV) Dipeptidyl peptidase 4 (DPP4) Dipeptidyl peptidase 4 membrane form Dipeptidyl peptidase IV Dipeptidyl peptidase IV (DDP-IV) Dipeptidyl peptidase IV membrane form Dipeptidyl peptidase-IV (DPP-4) T-cell activation antigen CD26 | TP103
Type:
Enzyme
Mol. Mass.:
88271.01
Organism:
Homo sapiens (Human)
Description:
P27487
Residue:
766
  
Inhibitor
Name:
BDBM50337763
Synonyms:
3-((R)-3-amino-4-(2,4,5-trifluorophenyl)butanoyl)-N-(furan-3-ylmethyl)thiazolidine-2-carboxamide hydrochloride | CHEMBL1683483
Type:
Small organic molecule
Emp. Form.:
C19H20F3N3O3S
Mol. Mass.:
427.441
SMILES:
N[C@@H](CC(=O)N1CCSC1C(=O)NCc1ccoc1)Cc1cc(F)c(F)cc1F
: