Target
Ceramide glucosyltransferase
Ligand
BDBM50356081
Substrate
Meas. Tech.
ChEMBL_775861 (CHEMBL1912402)
IC50
110±n/a nM
Citation
 Koltun, ERichards, SChan, VNachtigall, JDu, HNoson, KGalan, AAay, NHanel, AHarrison, AZhang, JWon, KATam, DQian, FWang, TFinn, POgilvie, KRosen, JMohan, RLarson, CLamb, PNuss, JKearney, P Discovery of a new class of glucosylceramide synthase inhibitors. Bioorg Med Chem Lett 21:6773-7 (2011)  
Target
Name:
Ceramide glucosyltransferase
Synonyms:
CEGT_HUMAN GLCT-1 UDP-glucose ceramide glucosyltransferase UGCG
Type:
PROTEIN
Mol. Mass.:
44859.25
Organism:
Homo sapiens (Human)
Description:
ChEMBL_1435474
Residue:
394
  
Inhibitor
Name:
BDBM50356081
Synonyms:
CHEMBL1911812
Type:
Small organic molecule
Emp. Form.:
C27H28BrClN4O4
Mol. Mass.:
587.893
SMILES:
CN1CCN(CC1)C(=O)[C@@H](COCc1ccccc1)NC(=O)c1cc(Br)cnc1Oc1ccc(Cl)cc1
: