Target
Ceramide glucosyltransferase
Ligand
BDBM50394820
Substrate
Meas. Tech.
ChEMBL_859947 (CHEMBL2167350)
IC50
10±n/a nM
Citation
 Richards, SLarson, CJKoltun, ESHanel, AChan, VNachtigall, JHarrison, AAay, NDu, HArcalas, AGalan, AZhang, JZhang, WWon, KATam, DQian, FWang, TFinn, POgilvie, KRosen, JAoyama, RPlonowski, ACancilla, BBentzien, FYakes, MMohan, RLamb, PNuss, JKearney, P Discovery and characterization of an inhibitor of glucosylceramide synthase. J Med Chem 55:4322-35 (2012)  
Target
Name:
Ceramide glucosyltransferase
Synonyms:
CEGT_HUMAN GLCT-1 UDP-glucose ceramide glucosyltransferase UGCG
Type:
PROTEIN
Mol. Mass.:
44859.25
Organism:
Homo sapiens (Human)
Description:
ChEMBL_1435474
Residue:
394
  
Inhibitor
Name:
BDBM50394820
Synonyms:
CHEMBL2163829
Type:
Small organic molecule
Emp. Form.:
C26H28Cl2N4O2
Mol. Mass.:
499.432
SMILES:
CN1CCN(CC1)C(=O)[C@H](Cc1c[nH]c2ccccc12)NC(=O)C1(CC1)c1ccc(Cl)cc1Cl
: