Target
Nuclear receptor ROR-gamma
Ligand
BDBM50153600
Substrate
Meas. Tech.
ChEMBL_1561097 (CHEMBL3776821)
EC50
400±n/a nM
Citation
 Hirata, KKotoku, MSeki, NMaeba, TMaeda, KHirashima, SSakai, TObika, SHori, AHase, YYamaguchi, TKatsuda, YHata, TMiyagawa, NArita, KNomura, YAsahina, KAratsu, YKamada, MAdachi, TNoguchi, MDoi, SCrowe, PBradley, ESteensma, RTao, HFenn, MBabine, RLi, XThacher, SHashimoto, HShiozaki, M SAR Exploration Guided by LE and Fsp(3): Discovery of a Selective and Orally Efficacious ROR¿ Inhibitor. ACS Med Chem Lett 7:23-7 (2016)  
Target
Name:
Nuclear receptor ROR-gamma
Synonyms:
Nr1f3 Nuclear receptor subfamily 1 group F member 3 RORG_MOUSE Rorc TOR Thymus orphan receptor
Type:
PROTEIN
Mol. Mass.:
58133.31
Organism:
Mus musculus
Description:
ChEMBL_103664
Residue:
516
  
Inhibitor
Name:
BDBM50153600
Synonyms:
CHEMBL3774878
Type:
Small organic molecule
Emp. Form.:
C26H26N4O
Mol. Mass.:
410.5108
SMILES:
CCn1c(CCC(=O)Nc2cccc3ccccc23)nnc1C1Cc2ccccc2C1
: