Target
Cocaine esterase
Ligand
BDBM50154561
Substrate
Meas. Tech.
ChEMBL_1561176 (CHEMBL3777369)
IC50
20±n/a nM
Citation
 Zou, LWLi, YGWang, PZhou, KHou, JJin, QHao, DCGe, GBYang, L Design, synthesis, and structure-activity relationship study of glycyrrhetinic acid derivatives as potent and selective inhibitors against human carboxylesterase 2. Eur J Med Chem 112:280-8 (2016)  
Target
Name:
Cocaine esterase
Synonyms:
CES2 EST2_HUMAN | ICE
Type:
PROTEIN
Mol. Mass.:
61801.08
Organism:
Homo sapiens (Human)
Description:
ChEMBL_1494240
Residue:
559
  
Inhibitor
Name:
BDBM50154561
Synonyms:
CHEMBL3774603
Type:
Small organic molecule
Emp. Form.:
C36H56O6
Mol. Mass.:
584.8262
SMILES:
[H][C@@]12C[C@](C)(CC[C@]1(C)CC[C@]1(C)C2=CC[C@]2([H])[C@@]3(C)CC[C@H](OC(=O)CCC(O)=O)C(C)(C)[C@]3([H])CC[C@@]12C)C(=O)OCC
: