Target
Cystic fibrosis transmembrane conductance regulator
Ligand
BDBM281048
Substrate
Meas. Tech.
Ussing Chamber Assay
EC50
38.1±n/a nM
Citation
 Hadida Ruah, SSGrootenhuis, PDVan Goor, FFZhou, JBear, BRMiller, MTMcCartney, JNuma, MM Modulators of ATP-binding cassette transporters US Patent  US10022352 Publication Date 7/17/2018 
Target
Name:
Cystic fibrosis transmembrane conductance regulator
Synonyms:
ABCC7 CFTR Channel conductance-controlling ATPase | cAMP-dependent chloride channel
Type:
Enzyme Catalytic Domain
Mol. Mass.:
168171.30
Organism:
Homo sapiens (Human)
Description:
gi_90421313
Residue:
1480
  
Inhibitor
Name:
BDBM281048
Synonyms:
US10022352, Compound 309
Type:
Small organic molecule
Emp. Form.:
C27H30F3N3O3
Mol. Mass.:
501.5406
SMILES:
CN(C)CCn1c(cc2cc(NC(=O)C3(CC3)c3ccc4OC(F)(F)Oc4c3)c(F)cc12)C(C)(C)C
: