Target
Acyl-homoserine lactone acylase PvdQ [A190E,F674L]
Ligand
BDBM113797
Substrate
Meas. Tech.
PvdQ IC50 Assay
IC50
1.4e+2± 6e+1 nM
Citation
 Wurst, JMDrake, EJTheriault, JRJewett, ITVerPlank, LPerez, JRDandapani, SPalmer, MMoskowitz, SMSchreiber, SLMunoz, BGulick, AM Identification of Inhibitors of PvdQ, an Enzyme Involved in the Synthesis of the Siderophore Pyoverdine. ACS Chem Biol 9:1536-44 (2014)  
Target
Name:
Acyl-homoserine lactone acylase PvdQ [A190E,F674L]
Synonyms:
PVDQ_PSEAE qsc112
Type:
Protein
Mol. Mass.:
84038.62
Organism:
Pseudomonas aeruginosa
Description:
Ntn hydrolase
Residue:
762
  
Inhibitor
Name:
BDBM113797
Synonyms:
2-(4-(Trifluoromethyl)phenyl)-2-(6-(trifluoromethyl) pyridin-2-yl)acetonitrile (29)
Type:
Small organic molecule
Emp. Form.:
C15H8F6N2
Mol. Mass.:
330.2278
SMILES:
FC(F)(F)c1ccc(cc1)C(C#N)c1cccc(n1)C(F)(F)F
: