Target
Isoform 1 of Metabotropic glutamate receptor 5 (5a)
Ligand
BDBM222780
Substrate
Meas. Tech.
Intracellular Ca2+ Mobilization Assay
Temperature
310.15±n/a K
EC50
75±n/a nM
Comments
extracted
Citation
 Green, LGuba, WJaeschke, GJolidon, SLindemann, LRicci, ARueher, DStadler, HVieira, E Arlethynyl derivatives US Patent  US9315498 Publication Date 4/19/2016 
Target
Name:
Isoform 1 of Metabotropic glutamate receptor 5 (5a)
Synonyms:
GPRC1E GRM5_HUMAN Metabotropic glutamate receptor 5 Metabotropic glutamate receptor 5 (mGlu5a) Metabotropic glutamate receptor 5a (mGluR5) Metabotropic glutamate receptor subtype 5 (mGluR5)
Type:
Enzyme
Mol. Mass.:
128885.13
Organism:
Homo sapiens (Human)
Description:
P41594-2
Residue:
1180
  
Inhibitor
Name:
BDBM222780
Synonyms:
US9315498, 66
Type:
Small organic molecule
Emp. Form.:
C20H19FN2O2
Mol. Mass.:
338.3755
SMILES:
COC1C(=O)N(CC1(C)C)c1ccc(cn1)C#Cc1ccc(F)cc1
: