Target
Tyrosine-protein kinase BTK
Ligand
BDBM348579
Substrate
Meas. Tech.
In vitro BTK kinase assay
IC50
<100±n/a nM
Citation
 Bui, MConlon, PCuervo, JHErlanson, DAFan, JGuan, BHopkins, BTJenkins, TJKumaravel, GLugovskoy, AAMarcotte, DPowell, NScott, DSilvian, LTaveras, AWang, DZhong, M Bruton's tyrosine kinase inhibitors US Patent  US10577374 Publication Date 3/3/2020 
Target
Name:
Tyrosine-protein kinase BTK
Synonyms:
AGMX1 Agammaglobulinaemia tyrosine kinase B cell progenitor kinase BPK BTK_HUMAN Tyrosine Kinase BTK Tyrosine-protein kinase BTK (BTK)
Type:
Enzyme
Mol. Mass.:
76289.95
Organism:
Homo sapiens (Human)
Description:
Q06187
Residue:
659
  
Inhibitor
Name:
BDBM348579
Synonyms:
US10577374, Compound 302 | US9790229, Compound 302
Type:
Small organic molecule
Emp. Form.:
C24H24F6N6O
Mol. Mass.:
526.4774
SMILES:
FC(F)(F)c1cc(NC2CCCN([C@@H]3CCCN(C3)c3ncnc4[nH]ccc34)C2=O)cc(c1)C(F)(F)F
: