Target
Tyrosine-protein kinase BTK
Ligand
BDBM348599
Substrate
Meas. Tech.
In Vitro BTK Kinase Assay
IC50
<100±n/a nM
Citation
 Bui, MConlon, PCuervo, JHErlanson, DAFan, JGuan, BHopkins, BTJenkins, TJKumaravel, GLugovskoy, AAMarcotte, DPowell, NScott, DSilvian, LTaveras, AWang, DZhong, M Bruton's tyrosine kinase inhibitors US Patent  US9790229 Publication Date 10/17/2017 
Target
Name:
Tyrosine-protein kinase BTK
Synonyms:
AGMX1 Agammaglobulinaemia tyrosine kinase B cell progenitor kinase BPK BTK_HUMAN Tyrosine Kinase BTK Tyrosine-protein kinase BTK (BTK)
Type:
Enzyme
Mol. Mass.:
76289.95
Organism:
Homo sapiens (Human)
Description:
Q06187
Residue:
659
  
Inhibitor
Name:
BDBM348599
Synonyms:
US10577374, Compound 322 | US9790229, Compound 322
Type:
Small organic molecule
Emp. Form.:
C22H21Cl2F3N6O
Mol. Mass.:
513.343
SMILES:
FC(F)(F)[C@H]1CCN(C[C@@H]1N1CC[C@@H](Nc2cc(Cl)cc(Cl)c2)C1=O)c1ncnc2[nH]ccc12
: