Target
Anoctamin-1
Ligand
BDBM50239459
Substrate
Meas. Tech.
ChEMBL_1666072 (CHEMBL4015868)
IC50
30±n/a nM
Citation
 Truong, ECPhuan, PWReggi, ALFerrera, LGalietta, LJVLevy, SEMoises, ACCil, ODiez-Cecilia, ELee, SVerkman, ASAnderson, MO Substituted 2-Acylaminocycloalkylthiophene-3-carboxylic Acid Arylamides as Inhibitors of the Calcium-Activated Chloride Channel Transmembrane Protein 16A (TMEM16A). J Med Chem 60:4626-4635 (2017)  
Target
Name:
Anoctamin-1
Synonyms:
ANO1 DOG1 ORAOV2 TAOS2 Transmembrane protein 16A | Tumor-amplified and overexpressed sequence 2
Type:
PROTEIN
Mol. Mass.:
114103.63
Organism:
Homo sapiens (Human)
Description:
ChEMBL_828184
Residue:
986
  
Inhibitor
Name:
BDBM50239459
Synonyms:
CHEMBL4074929
Type:
Small organic molecule
Emp. Form.:
C19H19BrF2N2O2S
Mol. Mass.:
457.332
SMILES:
Cc1ccccc1NC(=O)c1c(NC(=O)C(F)(F)Br)sc2CCCCCc12
: