Target
Beta-glucuronidase
Ligand
BDBM50183017
Substrate
Meas. Tech.
ChEMBL_1586150 (CHEMBL3821246)
IC50
9380±n/a nM
Citation
 Ali, FKhan, KMSalar, UIqbal, STaha, MIsmail, NHPerveen, SWadood, AGhufran, MAli, B Dihydropyrimidones: As novel class of฿-glucuronidase inhibitors. Bioorg Med Chem 24:3624-35 (2016)  
Target
Name:
Beta-glucuronidase
Synonyms:
Beta-glucuronidase EMBL:AAI33416.1 Ensembl:ENSBTAP00000000941} | GUSB
Type:
Protein
Mol. Mass.:
74467.69
Organism:
Bos taurus (Bovine)
Description:
EC 3.2.1.31, bovine liver
Residue:
652
  
Inhibitor
Name:
BDBM50183017
Synonyms:
CHEMBL3819636
Type:
Small organic molecule
Emp. Form.:
C14H13F3N2O3
Mol. Mass.:
314.2598
SMILES:
COC(=O)C1=C(C)NC(=O)NC1c1ccc(cc1)C(F)(F)F
: