Target
Beta-glucuronidase
Ligand
BDBM222108
Substrate
Meas. Tech.
β-Glucuronidase Inhibition Assay
IC50
3.540e+4± 7.0e+2 nM
Citation
 Salar, UKhan, KMSyed, STaha, MAli, FIsmail, NHPerveen, SWadood, AGhufran, M Synthesis, in vitro ß-glucuronidase inhibitory activity and in silico studies of novel (E)-4-Aryl-2-(2-(pyren-1-ylmethylene)hydrazinyl)thiazoles. Bioorg Chem 70:199-209 (2017)  
Target
Name:
Beta-glucuronidase
Synonyms:
Beta-glucuronidase EMBL:AAI33416.1 Ensembl:ENSBTAP00000000941} | GUSB
Type:
Protein
Mol. Mass.:
74467.69
Organism:
Bos taurus (Bovine)
Description:
EC 3.2.1.31, bovine liver
Residue:
652
  
Inhibitor
Name:
BDBM222108
Synonyms:
(E)-4-(3-Bromophenyl)-2-(2-(pyren-1-ylmethylene)hydrazinyl)thiazole (7)
Type:
Small organic molecule
Emp. Form.:
C26H16BrN3S
Mol. Mass.:
482.394
SMILES:
Brc1cccc(c1)-c1csc(N\N=C\c2ccc3ccc4cccc5ccc2c3c45)n1
: