Target
Beta-glucuronidase
Ligand
BDBM50160573
Substrate
Meas. Tech.
ChEMBL_1565959 (CHEMBL3790643)
IC50
15610±n/a nM
Citation
 Salar, UTaha, MIsmail, NHKhan, KMImran, SPerveen, SWadood, ARiaz, M Thiadiazole derivatives as New Class of฿-glucuronidase inhibitors. Bioorg Med Chem 24:1909-18 (2016)  
Target
Name:
Beta-glucuronidase
Synonyms:
Beta-glucuronidase EMBL:AAI33416.1 Ensembl:ENSBTAP00000000941} | GUSB
Type:
Protein
Mol. Mass.:
74467.69
Organism:
Bos taurus (Bovine)
Description:
EC 3.2.1.31, bovine liver
Residue:
652
  
Inhibitor
Name:
BDBM50160573
Synonyms:
CHEMBL3785397
Type:
Small organic molecule
Emp. Form.:
C16H13Cl2N3S
Mol. Mass.:
350.266
SMILES:
Cc1ccc(-c2nnc(Nc3ccc(Cl)c(Cl)c3)s2)c(C)c1
: