BDBM50089172 Benzoic acid 3-oxo-cyclohex-1-enyl ester::CHEMBL24610
SMILES O=C(OC1=CC(=O)CCC1)c1ccccc1
InChI Key InChIKey=OBDRHMVLOOMVQK-UHFFFAOYSA-N
Data  3 IC50
  Tab Delimited (TSV)   2D SDfile   Computed 3D by Vconf -m prep SDfile
Find this compound or compounds like it in BindingDB:
Activity Spreadsheet -- Enzyme Inhibition Constant Data from BindingDB
Found 3 hits for monomerid = 50089172
Target4-hydroxyphenylpyruvate dioxygenase(Pig)
Zhejiang University
Curated by ChEMBL
LigandPNGBDBM50089172(Benzoic acid 3-oxo-cyclohex-1-enyl ester | CHEMBL2...)
Affinity DataIC50:  1.58E+3nM. Assay description: Concentration required to achieve 50% inhibition against 4-Hydroxyphenylpyruvate dioxygenase (HPPD) from pig liver
In DepthDetails ArticlePubMed
Target4-hydroxyphenylpyruvate dioxygenase(Pig)
Zhejiang University
Curated by ChEMBL
LigandPNGBDBM50089172(Benzoic acid 3-oxo-cyclohex-1-enyl ester | CHEMBL2...)
Affinity DataIC50:  1.58E+3nM. Assay description: In vitro inhibitory activity of the compound against HPPD(4-hydroxyphenylpyruvate Dioxygenase) from pig liver using enol borate assay method
In DepthDetails ArticlePubMed
Target4-hydroxyphenylpyruvate dioxygenase(Pig)
Zhejiang University
Curated by ChEMBL
LigandPNGBDBM50089172(Benzoic acid 3-oxo-cyclohex-1-enyl ester | CHEMBL2...)
Affinity DataIC50:  1.59E+3nM. Assay description: Concentration required to achieve 50% inhibition against 4-Hydroxyphenylpyruvate dioxygenase (HPPD) from pig liver; (observed value)
In DepthDetails ArticlePubMed