BDBM50115205 CHEMBL3608705
SMILES COc1ccc(cc1)-c1c(cnn1-c1ccccc1)C(=O)Nc1ccc(Oc2ccnc3cc(sc23)-c2cn(C)cn2)c(F)c1
InChI Key InChIKey=ZDXDHMLGICQFIF-UHFFFAOYSA-N
Data  1 IC50
  Tab Delimited (TSV)   2D SDfile   Computed 3D by Vconf -m prep SDfile
Find this compound or compounds like it in BindingDB:
Activity Spreadsheet -- Enzyme Inhibition Constant Data from BindingDB
Found 1 hit for monomerid = 50115205
TargetHepatocyte growth factor receptor(Homo sapiens (Human))
Laboratoires Chemrf Inc/Chemrf Laboratories
Curated by ChEMBL
LigandPNGBDBM50115205(CHEMBL3608705)
Affinity DataIC50: >1.00E+4nM. Assay description: Inhibition of c-Met phosphorylation in human MKN45 cells
In DepthDetails ArticlePubMed