BDBM50157752 2-[2-(4-{[(2-carboxyphenyl)hydrazono]methyl}benzylidene)hydrazino]benzoic acid::CHEMBL224801
SMILES OC(=O)c1ccccc1N=NCc1ccc(CN=Nc2ccccc2C(O)=O)cc1
InChI Key InChIKey=WRVDKGWPRKEKCM-UHFFFAOYSA-N
Data  3 IC50
  Tab Delimited (TSV)   2D SDfile   Computed 3D by Vconf -m prep SDfile
Find this compound or compounds like it in BindingDB:
Activity Spreadsheet -- Enzyme Inhibition Constant Data from BindingDB
Found 3 hits for monomerid = 50157752
TargetCysteine protease falcipain-3 [5-492](malaria parasite P. falciparum)
University of Mississippi
Curated by ChEMBL
LigandPNGBDBM50157752(2-[2-(4-{[(2-carboxyphenyl)hydrazono]methyl}benzyl...)
Affinity DataIC50:  4.90E+3nM. Assay description: Inhibition of Plasmodium falciparum recombinant falcipain-3
In DepthDetails ArticlePubMed
TargetFalcipain 2(malaria parasite P. falciparum)
University of Mississippi
Curated by ChEMBL
LigandPNGBDBM50157752(2-[2-(4-{[(2-carboxyphenyl)hydrazono]methyl}benzyl...)
Affinity DataIC50:  1.00E+3nM. Assay description: Inhibition of Plasmodium falciparum recombinant falcipain-2
In DepthDetails ArticlePubMed
TargetCysteine protease(Leishmania donovani)
University of Mississippi
Curated by ChEMBL
LigandPNGBDBM50157752(2-[2-(4-{[(2-carboxyphenyl)hydrazono]methyl}benzyl...)
Affinity DataIC50:  7.20E+4nM. Assay description: Inhibition of Leishmania donovani cysteine protease
In DepthDetails ArticlePubMed