BDBM50245134 (2S,3R,4R,5S,6R)-2-(3-benzylphenyl)-6-(hydroxymethyl)-tetrahydro-2H-pyran-3,4,5-triol::CHEMBL486670
SMILES OC[C@H]1O[C@H]([C@H](O)[C@@H](O)[C@@H]1O)c1cccc(Cc2ccccc2)c1
InChI Key InChIKey=SZHXKKDXIWLWAN-FQBWVUSXSA-N
Data  1 EC50
  Tab Delimited (TSV)   2D SDfile   Computed 3D by Vconf -m prep SDfile
Find this compound or compounds like it in BindingDB:
Activity Spreadsheet -- Enzyme Inhibition Constant Data from BindingDB
Found 1 hit for monomerid = 50245134
TargetSodium/glucose cotransporter 2(Homo sapiens (Human))
Bristol Myers Squibb
Curated by ChEMBL
LigandPNGBDBM50245134((2S,3R,4R,5S,6R)-2-(3-benzylphenyl)-6-(hydroxymeth...)
Affinity DataEC50:  190nM. Assay description: Inhibition of human SGLT2 expressed in CHO cells assessed as intracellular accumulation of [14C]-alpha-methyl glucopyranoside
In DepthDetails ArticlePubMed