BDBM50354122 CHEMBL1836230
SMILES CCOc1ccccc1-n1c(CN2CCN(CC2)C(=O)c2ccco2)nc2cccc(C)c2c1=O
InChI Key InChIKey=BNSKPKDLQSFZNN-UHFFFAOYSA-N
Data  1 IC50
  Tab Delimited (TSV)   2D SDfile   Computed 3D by Vconf -m prep SDfile
Find this compound or compounds like it in BindingDB:
Activity Spreadsheet -- Enzyme Inhibition Constant Data from BindingDB
Found 1 hit for monomerid = 50354122
TargetHypoxia-inducible factor 1-alpha(Human)
National Human Genome Research Institute
Curated by ChEMBL
LigandPNGBDBM50354122(CHEMBL1836230)
Affinity DataIC50:  1.20E+3nM. Assay description: Inhibition of hypoxia-induced HIF1alpha activation in human ME180 cells by HRE3-Bla-luciferase reporter gene assay
In DepthDetails ArticlePubMed