BDBM50408482 CHEMBL5270640
SMILES CN(C)CCCN1c2cc(ccc2Sc2ccc(cc12)C(C)=O)C(C)=O
InChI Key InChIKey=WXRBGYDZETVCSH-UHFFFAOYSA-N
Data  1 IC50
  Tab Delimited (TSV)   2D SDfile   Computed 3D by Vconf -m prep SDfile
Find this compound or compounds like it in BindingDB:
Activity Spreadsheet -- Enzyme Inhibition Constant Data from BindingDB
Found 1 hit for monomerid = 50408482
TargetPlatelet-derived growth factor receptor alpha/beta(Mouse)
Massachusetts General Hospital
Curated by ChEMBL
LigandPNGBDBM50408482(CHEMBL5270640)
Affinity DataIC50:  13nM. Assay description: Antagonist activity at AT1 receptor assessed inhibition of angiotensin-2-induced contraction of rabbit thoracic aortic rings
In DepthDetails PubMed