BDBM90887 3-(9H-fluoren-9-ylmethoxycarbonylamino)propanoic acid::3-(9H-fluoren-9-ylmethoxycarbonylamino)propionic acid::3-[[9H-fluoren-9-ylmethoxy(oxo)methyl]amino]propanoic acid::MLS001197263::N-[(9H-fluoren-9-ylmethoxy)carbonyl]-beta-alanine::SMR000555404::cid_2724630
SMILES OC(=O)CCNC(=O)OCC1c2ccccc2-c2ccccc12
InChI Key InChIKey=LINBWYYLPWJQHE-UHFFFAOYSA-N
Data  1 EC50
  Tab Delimited (TSV)   2D SDfile   Computed 3D by Vconf -m prep SDfile
Find this compound or compounds like it in BindingDB:
Activity Spreadsheet -- Enzyme Inhibition Constant Data from BindingDB
Found 1 hit for monomerid = 90887
TargetCorticotropin-releasing factor-binding protein(Human)
Burnham Center For Chemical Genomics
Curated by PubChem BioAssay
LigandPNGBDBM90887(3-(9H-fluoren-9-ylmethoxycarbonylamino)propanoic a...)
Affinity DataEC50: >5.30E+4nM. Assay description: Data Source: Sanford-Burnham Center for Chemical Genomics (SBCCG) Source Affiliation: Sanford-Burnham Medical Research Institute (SBMRI, San Diego, C...
In DepthDetails PCBioAssay