BDBM100009 3-methyl-1-[2-(2H-1,2,3,4-tetrazol-5-yl)ethyl]-4,6-bis(trifluoromethyl)pyrazolo[3,4-b]pyridine::3-methyl-1-[2-(2H-tetrazol-5-yl)ethyl]-4,6-bis(trifluoromethyl)pyrazolo[3,4-b]pyridine::MLS000053578::SMR000066416::cid_2112393
SMILES Cc1nn(CCc2nnn[nH]2)c2nc(cc(c12)C(F)(F)F)C(F)(F)F
InChI Key InChIKey=FGMOQCGINZQATI-UHFFFAOYSA-N
Data  1 EC50
  Tab Delimited (TSV)   2D SDfile   Computed 3D by Vconf -m prep SDfile
Find this compound or compounds like it in BindingDB:
Activity Spreadsheet -- Enzyme Inhibition Constant Data from BindingDB
Found 1 hit for monomerid = 100009
TargetKallikrein-7(Homo sapiens (Human))
The Scripps Research Institute Molecular Screening Center
Curated by PubChem BioAssay
LigandPNGBDBM100009(3-methyl-1-[2-(2H-1,2,3,4-tetrazol-5-yl)ethyl]-4,6...)
Affinity DataEC50: >6.95E+4nM
In DepthDetails PCBioAssay