BDBM100018 1-(3-imidazo[1,2-a]pyrimidin-2-ylphenyl)sulfonylisonipecotic acid ethyl ester::1-[3-(2-imidazo[1,2-a]pyrimidinyl)phenyl]sulfonyl-4-piperidinecarboxylic acid ethyl ester::MLS000050929::SMR000078644::cid_2963573::ethyl 1-(3-imidazo[1,2-a]pyrimidin-2-ylphenyl)sulfonylpiperidine-4-carboxylate::ethyl 1-[(3-imidazo[1,2-a]pyrimidin-2-ylphenyl)sulfonyl]-4-piperidinecarboxylate
SMILES CCOC(=O)C1CCN(CC1)S(=O)(=O)c1cccc(c1)-c1cn2cccnc2n1
InChI Key InChIKey=GDXKGQFTVDRJLP-UHFFFAOYSA-N
Data  1 EC50
  Tab Delimited (TSV)   2D SDfile   Computed 3D by Vconf -m prep SDfile
Find this compound or compounds like it in BindingDB:
Activity Spreadsheet -- Enzyme Inhibition Constant Data from BindingDB
Found 1 hit for monomerid = 100018
TargetKallikrein-7(Homo sapiens (Human))
The Scripps Research Institute Molecular Screening Center
Curated by PubChem BioAssay
LigandPNGBDBM100018(1-(3-imidazo[1,2-a]pyrimidin-2-ylphenyl)sulfonylis...)
Affinity DataEC50: >6.95E+4nM
In DepthDetails PCBioAssay