BDBM100198 (4Z)-5-(2-furanyl)-4-[hydroxy-(5-methyl-1-phenyl-4-pyrazolyl)methylidene]-1-[2-(4-morpholinyl)ethyl]pyrrolidine-2,3-dione::(4Z)-5-(2-furyl)-4-[hydroxy-(5-methyl-1-phenyl-pyrazol-4-yl)methylene]-1-(2-morpholinoethyl)pyrrolidine-2,3-quinone::(4Z)-5-(furan-2-yl)-4-[(5-methyl-1-phenyl-pyrazol-4-yl)-oxidanyl-methylidene]-1-(2-morpholin-4-ylethyl)pyrrolidine-2,3-dione::(4Z)-5-(furan-2-yl)-4-[hydroxy-(5-methyl-1-phenylpyrazol-4-yl)methylidene]-1-(2-morpholin-4-ylethyl)pyrrolidine-2,3-dione::MLS000077939::SMR000041809::cid_5389306
SMILES Cc1c(cnn1-c1ccccc1)C(=O)C1C(N(CCN2CCOCC2)C(=O)C1=O)c1ccco1
InChI Key InChIKey=VGSSQYZDGJLNCI-UHFFFAOYSA-N
Data  2 IC50
  Tab Delimited (TSV)   2D SDfile   Computed 3D by Vconf -m prep SDfile
Find this compound or compounds like it in BindingDB:
Activity Spreadsheet -- Enzyme Inhibition Constant Data from BindingDB
Found 2 hits for monomerid = 100198
TargetTegument protein VP16(Human herpesvirus 1 (strain 17) (HHV-1) (Human her...)
The Scripps Research Institute Molecular Screening Center
Curated by PubChem BioAssay
LigandPNGBDBM100198((4Z)-5-(2-furanyl)-4-[hydroxy-(5-methyl-1-phenyl-4...)
Affinity DataIC50:  2.13E+4nM. Assay description: Source (MLPCN Center Name): The Scripps Research Institute Molecular Screening Center Affiliation: The Scripps Research Institute, TSRI Assay Provide...
In DepthDetails PCBioAssay
TargetCOUP transcription factor 2(Homo sapiens (Human))
The Scripps Research Institute Molecular Screening Center
Curated by PubChem BioAssay
LigandPNGBDBM100198((4Z)-5-(2-furanyl)-4-[hydroxy-(5-methyl-1-phenyl-4...)
Affinity DataIC50:  2.11E+4nM
In DepthDetails PCBioAssay