BDBM102151 US8530648, 48
SMILES O=C1N(Cc2cccc3cccnc23)CCCC11CCN(CC1)c1cnc2ccccc2n1
InChI Key InChIKey=JSRKOBGHJZTKOT-UHFFFAOYSA-N
Data  2 KI  2 Kd
  Tab Delimited (TSV)   2D SDfile   Computed 3D by Vconf -m prep SDfile
Find this compound or compounds like it in BindingDB:
Activity Spreadsheet -- Enzyme Inhibition Constant Data from BindingDB
Found 4 hits for monomerid = 102151
TargetOrexin receptor type 2(Homo sapiens (Human))
Novartis
US Patent
LigandPNGBDBM102151(US8530648, 48)
Affinity DataKi:  213nMpH: 7.4Assay Description:FLIPR assay using orexin receptor.
In DepthDetails US Patent
TargetOrexin/Hypocretin receptor type 1(Homo sapiens (Human))
Novartis
US Patent
LigandPNGBDBM102151(US8530648, 48)
Affinity DataKi:  1.76E+3nMpH: 7.4Assay Description:FLIPR assay using orexin receptor.
In DepthDetails US Patent
TargetOrexin receptor type 2(Homo sapiens (Human))
Novartis
US Patent
LigandPNGBDBM102151(US8530648, 48)
Affinity DataKd:  211nMpH: 7.5Assay Description:Radioligand binding assay using orexin receptor.
In DepthDetails US Patent
TargetOrexin/Hypocretin receptor type 1(Homo sapiens (Human))
Novartis
US Patent
LigandPNGBDBM102151(US8530648, 48)
Affinity DataKd:  3.28E+3nMpH: 7.5Assay Description:Radioligand binding assay using orexin receptor.
In DepthDetails US Patent