BDBM102173 US8530648, 97
SMILES O=C1CCCC2(CCN(CC2)c2cnc3ccccc3n2)N1Cc1c[nH]c2ccccc12
InChI Key InChIKey=OBJJCTFQGWCXGH-UHFFFAOYSA-N
Data  4 KI  2 Kd
  Tab Delimited (TSV)   2D SDfile   Computed 3D by Vconf -m prep SDfile
Find this compound or compounds like it in BindingDB:
Activity Spreadsheet -- Enzyme Inhibition Constant Data from BindingDB
Found 6 hits for monomerid = 102173
TargetOrexin receptor type 2(Homo sapiens (Human))
Novartis
US Patent
LigandPNGBDBM102173(US8530648, 97)
Affinity DataKi:  47nMpH: 7.4Assay Description:FLIPR assay using orexin receptor.
In DepthDetails US Patent
TargetOrexin receptor type 2(Homo sapiens (Human))
Novartis
US Patent
LigandPNGBDBM102173(US8530648, 97)
Affinity DataKi:  69nM. Assay description: Antagonist activity at human OX2 receptor expressed in HEK cells assessed as inhibition of orexin A-induced Ca2+ accumulation after 1 hr by Fluo-4-AM...
In DepthDetails ArticlePubMed
TargetOrexin/Hypocretin receptor type 1(Homo sapiens (Human))
Novartis
US Patent
LigandPNGBDBM102173(US8530648, 97)
Affinity DataKi:  236nMpH: 7.4Assay Description:FLIPR assay using orexin receptor.
In DepthDetails US Patent
TargetOrexin/Hypocretin receptor type 1(Homo sapiens (Human))
Novartis
US Patent
LigandPNGBDBM102173(US8530648, 97)
Affinity DataKi:  275nM. Assay description: Antagonist activity at human OX1 receptor expressed in CHO cells assessed as inhibition of orexin A-induced Ca2+ accumulation after 1 hr by Fluo-4-AM...
In DepthDetails ArticlePubMed
TargetOrexin/Hypocretin receptor type 1(Homo sapiens (Human))
Novartis
US Patent
LigandPNGBDBM102173(US8530648, 97)
Affinity DataKd:  205nMpH: 7.5Assay Description:Radioligand binding assay using orexin receptor.
In DepthDetails US Patent
TargetOrexin receptor type 2(Homo sapiens (Human))
Novartis
US Patent
LigandPNGBDBM102173(US8530648, 97)
Affinity DataKd:  196nMpH: 7.5Assay Description:Radioligand binding assay using orexin receptor.
In DepthDetails US Patent