BDBM103681 US8563553, 106
SMILES Nc1nccc(n1)-c1nc([nH]c1-c1cc(Cl)cc(NS(=O)(=O)c2c(F)cccc2F)c1F)C1CC1
InChI Key InChIKey=VTOGIRDDBFRTNZ-UHFFFAOYSA-N
Data  1 IC50
  Tab Delimited (TSV)   2D SDfile   Computed 3D by Vconf -m prep SDfile
Find this compound or compounds like it in BindingDB:
Activity Spreadsheet -- Enzyme Inhibition Constant Data from BindingDB
Found 1 hit for monomerid = 103681
TargetSerine/threonine-protein kinase B-raf [V600E](Homo sapiens (Human))
Novartis
US Patent
LigandPNGBDBM103681(US8563553, 106)
Affinity DataIC50:  0.100nMpH: 7.5Assay Description:Raf/Mek amplified luminescence proximity homogeneous assay.
In DepthDetails US Patent