BDBM106997 US8592579, 71
SMILES CC(C)(C)c1cc(Nc2nc(nn3cccc23)N2CCC[C@@]2(C)C(=O)NC2CCCNC2)[nH]n1
InChI Key InChIKey=GIRUEKBNVXPYQZ-ODOSRFNGSA-N
Data  1 IC50
  Tab Delimited (TSV)   2D SDfile   Computed 3D by Vconf -m prep SDfile
Find this compound or compounds like it in BindingDB:
Activity Spreadsheet -- Enzyme Inhibition Constant Data from BindingDB
Found 1 hit for monomerid = 106997
TargetInsulin-like growth factor 1 receptor(Homo sapiens (Human))
Bristol-Myers Squibb
US Patent
LigandPNGBDBM106997(US8592579, 71)
Affinity DataIC50:  428nMpH: 7.4Assay Description:Kinase assay using IGF1-receptor.
In DepthDetails US Patent